BDBM259563 US9505749, 74
SMILES Clc1ccc2n([C@H]3CC[C@@H](CC3)NC(=O)CCCc3nc4ccccc4c(=O)[nH]3)c(=O)[nH]c2c1
InChI Key
Data  1 IC50
  Tab Delimited (TSV)   2D SDfile   Computed 3D by Vconf -m prep SDfile
Find this compound or compounds like it in BindingDB:
Activity Spreadsheet -- Enzyme Inhibition Constant Data from BindingDB
Found 1 hit for monomerid = 259563
TargetPoly [ADP-ribose] polymerase tankyrase-1 [1091-1325](Homo sapiens (Human))
Amgen
US Patent
LigandPNGBDBM259563(US9505749, 74)
Affinity DataIC50:  0.161nM. Assay description: The tankyrase 1 biochemical activity of the compounds was assayed in the following assay buffer (50 mM MOPS pH7.5, 100 mM NaCl, 2.5 mM MgCl2, 0.01% T...
Ligand InfoPC cidPC sid
In DepthDetails US Patent